{"text_format":"1","workbook":"xlsx","n_sheets":4,"sheets":["INSTRUCTIONS","Credit Application","Ship to Location Listing","OPTIONS"],"not_rendered":{"charts":0,"images":2,"macros":1,"external_links":0,"defined_names":1,"comments":0,"pivot_tables":0},"unopened":[],"bounds":{"document_bytes":16777216,"sheet_cells":100000,"rows_first":2000,"rows_last":500,"rows_between":2000,"halvings":0,"cell_chars":16384,"cell_head_chars":4096},"cells_cut":0,"cells_raw":0,"read":"whole","date_system":"1900"}

{"sheet":"INSTRUCTIONS","index":0,"n_rows":36,"n_cols":6,"rows_kept":36,"cut":false,"hidden":false,"merged":[[11,1,11,3],[35,1,35,7],[29,1,33,9]]}
[]
[]
[]
[]
[]
[]
[]
[]
[]
[]
[null,null,null,null,null,"Please send your completed credit application to:"]
[null,"(select one)",null,null,null,{"$f":"IF(B12<>\"(select one)\",VLOOKUP(B12,OPTIONS!$E$17:$F$22,2,FALSE),\"\")","v":""}]
[]
[null,"Included tabs in this file are the credit application and a form to complete for your shipping addresses.   "]
[]
[null,"You can click on the hyperlinks in the headings below to take you to each tab."]
[]
[null,"Credit Application"]
[null,"Please complete the credit application if you or your company would like to have credit terms with one of our"]
[null,"Custom Connect companies."]
[]
[null,"Ship to Location Listing"]
[null,"If your company has multiple ship to locations you can enter them in the 'Ship to Location Listing' tab "]
[null,"of this document."]
[]
[null,"Sales Tax"]
[null,"Where required, sales tax will be calculated unless a valid tax exemption certificate has been received. "]
[null,"If you have a valid tax exemption certificate, please follow the instructions below."]
[]
[null,{"$f":"IF(B12<>\"(select one)\",VLOOKUP(B12,OPTIONS!$E$17:$H$20,4,FALSE),\"\")","v":""}]
[]
[]
[]
[]
[]
[null,{"$f":"IF(B12<>\"(select one)\",HYPERLINK(VLOOKUP(B12,OPTIONS!$E$17:$I$20,5,FALSE)),\"\")","v":""}]

{"sheet":"Credit Application","index":1,"n_rows":172,"n_cols":7,"rows_kept":172,"cut":false,"hidden":false,"merged":[[24,6,24,7],[28,2,28,3],[28,4,28,5],[28,6,28,7],[18,3,19,7],[170,2,170,3],[24,2,24,3],[24,4,24,5],[146,2,146,3],[146,5,146,7],[149,2,149,3],[149,5,149,7],[161,5,161,7],[167,5,167,7],[161,2,161,3],[167,2,167,3],[164,2,164,3],[143,2,143,3],[143,5,143,7],[80,2,80,3],[77,5,77,7],[12,4,12,7],[10,4,10,7],[16,3,16,4],[16,5,16,7],[14,3,14,4],[140,2,140,3],[140,5,140,7],[64,2,64,7],[66,2,66,3],[66,4,66,7],[68,3,68,4],[70,2,70,7],[68,5,68,7],[85,3,85,5],[77,2,77,3],[80,5,80,7],[103,2,103,3],[106,2,106,3],[103,5,103,7],[106,5,106,7],[36,2,36,4],[40,4,40,7],[46,4,46,7],[44,2,44,7],[38,2,38,7],[62,2,62,3],[62,4,62,7],[50,2,50,7],[48,2,48,4],[42,2,42,4],[57,5,57,7],[56,5,56,7],[3,5,3,7],[17,2,17,7],[14,5,14,7],[34,1,53,1],[110,2,110,7],[4,1,20,1],[22,1,31,1],[6,2,6,3],[6,4,6,7],[8,2,8,7],[26,2,26,7],[30,2,30,7],[52,4,52,7],[48,5,48,7],[36,5,36,7],[42,5,42,7]]}
[]
[]
[null,null,null,"COMMERCIAL CREDIT APPLICATION"]
[null,null,null,null,null,{"$f":"+INSTRUCTIONS!B12","v":"(select one)"}]
[null,"BUSINESS"]
[null,null,"Company Name",null,"Trade Name (DBA)"]
[]
[null,null,"Billing Address (Street)","(City)","(State)","(Zip Code)"]
[]
[null,null,"Purchasing Contact Name","Telephone","Purchasing Email Address"]
[]
[null,null,"Accounts Payable Contact Name","Telephone","Accounts Payable Email Address"]
[]
[null,null,"Federal Tax ID","Primary Nature of Your Business",null,"Dun & Bradstreet (DNB) Number"]
[]
[null,null,"Description of Property or Service to be Purchased","Date of Present Ownership",null,"Credit Line being requested"]
[]
[null,null,"In Compliance with Sales & Use Tax laws, it is necessary that we collect a properly completed exemption certificate, if you are claiming an exemption from sales tax. In addition to completing this form an exemption certificate for each state you are claiming an exemption must be submitted."]
[null,null,"Sales Tax Exemption (select from drop down below)","PLEASE SEE INSTRUCTIONS TAB FOR SUBMITTING TAX EXEMPTION CERTIFICATE(S)."]
[null,null,"(select one)"]
[]
[]
[null,"OFFICERS"]
[null,null,"Officers Name",null,"Title",null,"Home Phone No"]
[]
[null,null,"Home Address (Street)","(City)","(State)","(Zip Code)"]
[]
[null,null,"Officers Name",null,"Title",null,"Home Phone No"]
[]
[null,null,"Home Address (Street)","(City)","(State)","(Zip Code)"]
[]
[]
[]
[null,null,"Please list contact information of at least 3 businesses that have extended credit and are used regularly."]
[null,"TRADE REFERENCEES"]
[null,null,"Company Name #1",null,null,"Length of Business Relationship"]
[]
[null,null," Address (Street)","(City)","(State)","(Zip Code)"]
[]
[null,null,"Contact Name","Telephone","Email Address"]
[]
[null,null,"Company Name #2",null,null,"Length of Business Relationship"]
[]
[null,null," Address (Street)","(City)","(State)","(Zip Code)"]
[]
[null,null,"Contact Name","Telephone","Email Address"]
[]
[null,null,"Company Name #3",null,null,"Length of Business Relationship"]
[]
[null,null," Address (Street)","(City)","(State)","(Zip Code)"]
[]
[null,null,"Contact Name","Telephone","Email Address"]
[]
[]
[]
[]
[null,null,null,null,null,"Email completed form to:"]
[null,null,null,"CONFIDENTIAL",null,{"$f":"+INSTRUCTIONS!F12","v":""}]
[null,null,null,"REQUEST FOR BANK CREDIT INFORMATION"]
[]
[]
[null,null,"Company Name",null,"Name on Bank Account"]
[]
[null,null,"Company Address (Street)","(City)","(State)","(Zip Code)"]
[]
[null,null,"Telephone",null,"Bank Account Number for Reference"]
[]
[null,null,"Bank Name","Bank Telephone",null,"Bank Fax"]
[]
[null,null,"Bank Address (Street)","(City)","(State)","(Zip Code)"]
[]
[]
[null,null,"The above account has given the name of your bank as a reference in applying for credit terms with our company."]
[null,null,"We would greatly appreciate you completing the information below.  All information will be held in strict confidence."]
[]
[null,null,"Please accept this as an authorization to verify and/or release the information requested by Stahls' Inc."]
[]
[]
[null,null,"Authorized Applicant Signature / Signer on Bank Account",null,null,"Title"]
[]
[]
[null,null,"Type or Print Name",null,null,"Date"]
[]
[null,null,"THIS SECTION TO BE COMPLETED BY THE BANK ONLY"]
[]
[null,null,"Date Account reference above was opened:"]
[]
[null,null,"Any history of NSF Checks?",null,"How many in the last 12 months?"]
[]
[null,null,"Is the applicants deposit account relationship in currently in good standing? (circle one)",null,null,"Yes","No"]
[]
[null,null,"Average  Monthly Account Balance:"]
[]
[null,null,"BANK FINANCED LOANS"]
[]
[null,null,null,"High Balance",null,"Present Balance"]
[]
[null,null,"Unsecured","$",null,"$"]
[]
[null,null,"Secured","$",null,"$"]
[]
[null,null,"Loan Experience (circle one) :","Satisfactory",null,"Unsatisfactory"]
[]
[]
[null,null,"Authorized Bank Signature",null,null,"Bank Representative Title"]
[]
[]
[null,null,"Type or Print Name",null,null,"Date"]
[]
[]
[null,null,"STAHLS' INC. 25901 JEFFERSON AVE., SAINT CLAIR SHORES, MI  48081"]
[]
[]
[]
[null,null,null,"TERMS & CONDITIONS"]
[]
[]
[]
[]
[]
[]
[]
[]
[]
[]
[]
[]
[]
[]
[]
[]
[]
[]
[]
[]
[]
[]
[]
[]
[]
[]
[null,null,"Authorized Company Signature",null,null,"Title"]
[]
[]
[null,null,"Type or Print Name",null,null,"Date"]
[]
[]
[null,null,"Authorized Company Signature",null,null,"Title"]
[]
[]
[null,null,"Type or Print Name",null,null,"Date"]
[]
[null,null,null,"GUARANTY"]
[]
[]
[]
[]
[]
[]
[]
[]
[]
[null,null,"Authorized Company Signature",null,null,"Date"]
[]
[]
[null,null,"Type or Print Name"]
[]
[]
[null,null,"Authorized Company Signature",null,null,"Date"]
[]
[]
[null,null,"Type or Print Name"]

{"sheet":"Ship to Location Listing","index":2,"n_rows":100,"n_cols":10,"rows_kept":100,"cut":false,"hidden":false,"merged":[[2,4,2,6]]}
[]
[null,null,null,null,null,null,null,null,null,"Ship to"]
[null,null,null,null,{"$f":"+INSTRUCTIONS!B12","v":"(select one)"},null,null,null,null,"Bill to"]
["SHIP TO LOCATION LISTING",null,null,null,null,null,null,null,null,"SELECT ONE"]
[]
["Location Name / Number","Ship to / Bill to","Address 1","Address 2","City","State","Zip"]
[null,"SELECT ONE"]
[null,"SELECT ONE"]
[null,"SELECT ONE"]
[null,"SELECT ONE"]
[null,"SELECT ONE"]
[null,"SELECT ONE"]
[null,"SELECT ONE"]
[null,"SELECT ONE"]
[null,"SELECT ONE"]
[null,"SELECT ONE"]
[null,"SELECT ONE"]
[null,"SELECT ONE"]
[null,"SELECT ONE"]
[null,"SELECT ONE"]
[null,"SELECT ONE"]
[null,"SELECT ONE"]
[null,"SELECT ONE"]
[null,"SELECT ONE"]
[null,"SELECT ONE"]
[null,"SELECT ONE"]
[null,"SELECT ONE"]
[null,"SELECT ONE"]
[null,"SELECT ONE"]
[null,"SELECT ONE"]
[null,"SELECT ONE"]
[null,"SELECT ONE"]
[null,"SELECT ONE"]
[null,"SELECT ONE"]
[null,"SELECT ONE"]
[null,"SELECT ONE"]
[null,"SELECT ONE"]
[null,"SELECT ONE"]
[null,"SELECT ONE"]
[null,"SELECT ONE"]
[null,"SELECT ONE"]
[null,"SELECT ONE"]
[null,"SELECT ONE"]
[null,"SELECT ONE"]
[null,"SELECT ONE"]
[null,"SELECT ONE"]
[null,"SELECT ONE"]
[null,"SELECT ONE"]
[null,"SELECT ONE"]
[null,"SELECT ONE"]
[null,"SELECT ONE"]
[null,"SELECT ONE"]
[null,"SELECT ONE"]
[null,"SELECT ONE"]
[null,"SELECT ONE"]
[null,"SELECT ONE"]
[null,"SELECT ONE"]
[null,"SELECT ONE"]
[null,"SELECT ONE"]
[null,"SELECT ONE"]
[null,"SELECT ONE"]
[null,"SELECT ONE"]
[null,"SELECT ONE"]
[null,"SELECT ONE"]
[null,"SELECT ONE"]
[null,"SELECT ONE"]
[null,"SELECT ONE"]
[null,"SELECT ONE"]
[null,"SELECT ONE"]
[null,"SELECT ONE"]
[null,"SELECT ONE"]
[null,"SELECT ONE"]
[null,"SELECT ONE"]
[null,"SELECT ONE"]
[null,"SELECT ONE"]
[null,"SELECT ONE"]
[null,"SELECT ONE"]
[null,"SELECT ONE"]
[null,"SELECT ONE"]
[null,"SELECT ONE"]
[null,"SELECT ONE"]
[null,"SELECT ONE"]
[null,"SELECT ONE"]
[null,"SELECT ONE"]
[null,"SELECT ONE"]
[null,"SELECT ONE"]
[null,"SELECT ONE"]
[null,"SELECT ONE"]
[null,"SELECT ONE"]
[null,"SELECT ONE"]
[null,"SELECT ONE"]
[null,"SELECT ONE"]
[null,"SELECT ONE"]
[null,"SELECT ONE"]
[null,"SELECT ONE"]
[null,"SELECT ONE"]
[null,"SELECT ONE"]
[null,"SELECT ONE"]
[null,"SELECT ONE"]
[null,"SELECT ONE"]

{"sheet":"OPTIONS","index":3,"n_rows":60,"n_cols":9,"rows_kept":60,"cut":false,"hidden":true,"merged":[]}
[]
[]
[]
["Sales Tax Options",null,"Entity"]
["(select one)",null,"(select one)"]
["Exempt from Sales Tax",null,"Stahls'"]
["NOT Exempt from Sales Tax",null,"Stahls' Canada"]
[null,null,"Transfer Express"]
[null,null,"Stahls' DFC"]
[null,null,"Hotronix"]
["Alabama","AL"]
["Alaska","AK"]
["Arizona","AZ"]
["Arkansas","AR"]
["California","CA"]
["Colorado","CO",null,null,null,"Email Address to remit ",null,null,"Sales Tax Exemption"]
["Connecticut","CT",null,null,"Stahls'","credit@stahls.com",null,"Please click on this link below (or copy and paste in your browser) to register, or login if you have already placed orders on our website,  review or complete all sections of the form and submit. You will receive an email from  CertificateManager@thompsonreuters.com with a link to access your exemption account, enter and upload your exemption certificate(s).","https://www.stahls.com/salestax "]
["Delaware","DE",null,null,"Stahls' Canada","credit@stahls.com",null,"Please attach exemption certificates to your email when you submit your Credit Application","   "]
["Florida","FL",null,null,"Transfer Express","credit@stahls.com",null,"Please click on this link below (or copy and paste in your browser) to register, or login if you have already placed orders on our website,  review or complete all sections of the form and submit. You will receive an email from  CertificateManager@thompsonreuters.com with a link to access your exemption account, enter and upload your exemption certificate(s).","https://www.transferexpress.com/salestax "]
["Georgia","GA",null,null,"Stahls' DFC","dfcaccounting@stahlsdfc.com",null,"Please attach exemption certificates to your email when you submit your Credit Application"]
["Hawaii","HI",null,null,"Hotronix","credit@hotronix.com",null,"Please attach exemption certificates to your email when you submit your Credit Application"]
["Idaho","ID"]
["Illinois","IL"]
["Indiana","IN"]
["Iowa","IA"]
["Kansas","KS"]
["Kentucky","KY"]
["Louisiana","LA"]
["Maine","ME"]
["Maryland","MD"]
["Massachusetts","MA"]
["Michigan","MI"]
["Minnesota","MN"]
["Mississippi","MS"]
["Missouri","MO"]
["Montana","MT"]
["Nebraska","NE"]
["Nevada","NV"]
["New Hampshire","NH"]
["New Jersey","NJ"]
["New Mexico","NM"]
["New York","NY"]
["North Carolina","NC"]
["North Dakota","ND"]
["Ohio","OH"]
["Oklahoma","OK"]
["Oregon","OR"]
["Pennsylvania","PA"]
["Rhode Island","RI"]
["South Carolina","SC"]
["South Dakota","SD"]
["Tennessee","TN"]
["Texas","TX"]
["Utah","UT"]
["Vermont","VT"]
["Virginia","VA"]
["Washington","WA"]
["West Virginia","WV"]
["Wisconsin","WI"]
["Wyoming","WY"]